Target
DNA repair protein RAD51 homolog 1
Ligand
BDBM51315
Substrate
Meas. Tech.
Homologous recombination_Rad 51_dose response_2
IC50
50880±n/a nM
Citation
 PubChem, PC Homologous recombination_Rad 51_dose response_2 PubChem Bioassay (2008)[AID] 
Target
Name:
DNA repair protein RAD51 homolog 1
Synonyms:
RAD51 RAD51_HUMAN | RECA
Type:
Enzyme Catalytic Domain
Mol. Mass.:
36960.74
Organism:
Homo sapiens (Human)
Description:
gi_49168602
Residue:
339
  
Inhibitor
Name:
BDBM51315
Synonyms:
3-[(2Z)-2-(3-formyl-4-oxo-1-cyclohexa-2,5-dienylidene)hydrazinyl]benzoic acid 3-[(2Z)-2-(3-methanoyl-4-oxidanylidene-cyclohexa-2,5-dien-1-ylidene)hydrazinyl]benzoic acid 3-[(N'Z)-N'-(3-formyl-4-keto-cyclohexa-2,5-dien-1-ylidene)hydrazino]benzoic acid SMR000312380 | cid_6520603
Type:
Small organic molecule
Emp. Form.:
C14H10N2O4
Mol. Mass.:
270.2402
SMILES:
OC(=O)c1cccc(c1)N=Nc1ccc(O)c(C=O)c1
: