Target
DNA repair protein RAD51 homolog 1
Ligand
BDBM43842
Substrate
Meas. Tech.
Homologous recombination_Rad 51_dose response_2
IC50
53000±n/a nM
Citation
 PubChem, PC Homologous recombination_Rad 51_dose response_2 PubChem Bioassay (2008)[AID] 
Target
Name:
DNA repair protein RAD51 homolog 1
Synonyms:
RAD51 RAD51_HUMAN | RECA
Type:
Enzyme Catalytic Domain
Mol. Mass.:
36960.74
Organism:
Homo sapiens (Human)
Description:
gi_49168602
Residue:
339
  
Inhibitor
Name:
BDBM43842
Synonyms:
Acid, 24 N-(1,1-diketothiolan-3-yl)-N-methyl-2-[[4-phenyl-5-(4-pyridyl)-1,2,4-triazol-3-yl]thio]acetamide N-(1,1-dioxothiolan-3-yl)-N-methyl-2-[(4-phenyl-5-pyridin-4-yl-1,2,4-triazol-3-yl)sulfanyl]acetamide SMR000352944 | cid_4409405
Type:
Small organic molecule
Emp. Form.:
C20H21N5O3S2
Mol. Mass.:
443.542
SMILES:
CN(C1CCS(=O)(=O)C1)C(=O)CSc1nnc(-c2ccncc2)n1-c1ccccc1
: