Target
DNA repair protein RAD51 homolog 1
Ligand
BDBM43846
Substrate
Meas. Tech.
Homologous recombination_Rad 51_dose response_2
IC50
53000±n/a nM
Citation
 PubChem, PC Homologous recombination_Rad 51_dose response_2 PubChem Bioassay (2008)[AID] 
Target
Name:
DNA repair protein RAD51 homolog 1
Synonyms:
RAD51 RAD51_HUMAN | RECA
Type:
Enzyme Catalytic Domain
Mol. Mass.:
36960.74
Organism:
Homo sapiens (Human)
Description:
gi_49168602
Residue:
339
  
Inhibitor
Name:
BDBM43846
Synonyms:
3-[1,3-bis(oxidanylidene)isoindol-2-yl]-N-(4,5-dihydro-1,3-thiazol-2-yl)benzamide Acid, 54 N-(4,5-dihydro-1,3-thiazol-2-yl)-3-(1,3-dioxoisoindol-2-yl)benzamide SMR000376428 | cid_2095524
Type:
Small organic molecule
Emp. Form.:
C18H13N3O3S
Mol. Mass.:
351.379
SMILES:
O=C(NC1=NCCS1)c1cccc(c1)N1C(=O)c2ccccc2C1=O
: