Target
E3 ubiquitin-protein ligase Mdm2
Ligand
BDBM43395
Substrate
Meas. Tech.
E3 Ligase_Mutant_Dose Response
EC50
215670±n/a nM
Citation
 PubChem, PC E3 Ligase_Mutant_Dose Response PubChem Bioassay (2008)[AID] 
Target
Name:
E3 ubiquitin-protein ligase Mdm2
Synonyms:
Double minute 2 protein E3 ubiquitin-protein ligase Mdm2 (p53-binding protein Mdm2) Human Double Minute 2 (HDM2) MDM2-MDMX p53-Binding Protein MDM2 | p53-binding protein
Type:
Oncoprotein
Mol. Mass.:
55196.54
Organism:
Homo sapiens (Human)
Description:
Q00987
Residue:
491
  
Inhibitor
Name:
BDBM43395
Synonyms:
(2E)-2-[4-(diethylamino)benzylidene]-1,3-diketo-indane-5-carboxylic acid (2E)-2-[[4-(diethylamino)phenyl]methylidene]-1,3-dioxo-5-indenecarboxylic acid 2-[1-(4-Diethylamino-phenyl)-meth-(E)-ylidene]-1,3-dioxo-indan-5-carboxylic acid SMR000218076 | cid_741762
Type:
Small organic molecule
Emp. Form.:
C21H19NO4
Mol. Mass.:
349.3799
SMILES:
CCN(CC)c1ccc(\C=C2/C(=O)c3ccc(cc3C2=O)C(O)=O)cc1
: