Target
E3 ubiquitin-protein ligase Mdm2
Ligand
BDBM43362
Substrate
Meas. Tech.
E3 Ligase_WT_Dose Response
EC50
400±n/a nM
Citation
 PubChem, PC E3 Ligase_WT_Dose Response PubChem Bioassay (2008)[AID] 
Target
Name:
E3 ubiquitin-protein ligase Mdm2
Synonyms:
Double minute 2 protein E3 ubiquitin-protein ligase Mdm2 (p53-binding protein Mdm2) Human Double Minute 2 (HDM2) MDM2-MDMX p53-Binding Protein MDM2 | p53-binding protein
Type:
Oncoprotein
Mol. Mass.:
55196.54
Organism:
Homo sapiens (Human)
Description:
Q00987
Residue:
491
  
Inhibitor
Name:
BDBM43362
Synonyms:
MLS000069752 N,N-dimethylcarbamodithioic acid [[dimethylamino(sulfanylidene)methyl]thio] ester TETRAMETHYLTHIURAM DISULFIDE dimethylcarbamothioylsulfanyl N,N-dimethylcarbamodithioate
Type:
Small organic molecule
Emp. Form.:
C6H12N2S4
Mol. Mass.:
240.433
SMILES:
CN(C)C(=S)SSC(=S)N(C)C
: