Target
Alkaline phosphatase, tissue-nonspecific isozyme
Ligand
BDBM51397
Substrate
Meas. Tech.
SAR assay for compounds activating TNAP in the presence of 100 mM DEA performed in a luminescence assay
EC50
5850±n/a nM
Citation
 PubChem, PC SAR assay for compounds activating TNAP in the presence of 100 mM DEA performed in a luminescence assay PubChem Bioassay (2009)[AID] 
Target
Name:
Alkaline phosphatase, tissue-nonspecific isozyme
Synonyms:
ALPL tissue-nonspecific alkaline phosphatase precursor
Type:
PROTEIN
Mol. Mass.:
57306.17
Organism:
Homo sapiens (Human)
Description:
ChEMBL_1448917
Residue:
524
  
Inhibitor
Name:
BDBM51397
Synonyms:
5,5,7,12,12,14-hexamethyl-1,4,8,11-tetrazacyclotetradecane cid_143337
Type:
Small organic molecule
Emp. Form.:
C16H36N4
Mol. Mass.:
284.4838
SMILES:
CC1CC(C)(C)NCCNC(C)CC(C)(C)NCCN1
: