Target
Alkaline phosphatase, tissue-nonspecific isozyme
Ligand
BDBM43795
Substrate
Meas. Tech.
SAR assay for compounds activating TNAP in the presence of 100 mM DEA performed in a luminescence assay
EC50
15000±n/a nM
Citation
 PubChem, PC SAR assay for compounds activating TNAP in the presence of 100 mM DEA performed in a luminescence assay PubChem Bioassay (2009)[AID] 
Target
Name:
Alkaline phosphatase, tissue-nonspecific isozyme
Synonyms:
ALPL tissue-nonspecific alkaline phosphatase precursor
Type:
PROTEIN
Mol. Mass.:
57306.17
Organism:
Homo sapiens (Human)
Description:
ChEMBL_1448917
Residue:
524
  
Inhibitor
Name:
BDBM43795
Synonyms:
MLS-0093538.0001 N'-[2-(3,5-dimethylphenoxy)acetyl]-5-methyl-1H-pyrazole-3-carbohydrazide cid_969126
Type:
Small organic molecule
Emp. Form.:
C15H18N4O3
Mol. Mass.:
302.3284
SMILES:
Cc1cc([nH]n1)C(=O)NNC(=O)COc1cc(C)cc(C)c1
: