Target
Alkaline phosphatase, tissue-nonspecific isozyme
Ligand
BDBM43803
Substrate
Meas. Tech.
SAR assay for compounds activating TNAP in the presence of 100 mM DEA performed in a luminescence assay
EC50
3790±n/a nM
Citation
 PubChem, PC SAR assay for compounds activating TNAP in the presence of 100 mM DEA performed in a luminescence assay PubChem Bioassay (2009)[AID] 
Target
Name:
Alkaline phosphatase, tissue-nonspecific isozyme
Synonyms:
ALPL tissue-nonspecific alkaline phosphatase precursor
Type:
PROTEIN
Mol. Mass.:
57306.17
Organism:
Homo sapiens (Human)
Description:
ChEMBL_1448917
Residue:
524
  
Inhibitor
Name:
BDBM43803
Synonyms:
2-(4-keto-6-propyl-1H-pyrimidin-2-yl)-4,5,6,7-tetrahydro-1H-indazol-3-one 2-(4-oxo-6-propyl-1H-pyrimidin-2-yl)-4,5,6,7-tetrahydro-1H-indazol-3-one cid_3762210
Type:
Small organic molecule
Emp. Form.:
C14H18N4O2
Mol. Mass.:
274.3183
SMILES:
CCCc1cc(=O)[nH]c(n1)-n1[nH]c2CCCCc2c1=O
: