Target
Alkaline phosphatase, tissue-nonspecific isozyme
Ligand
BDBM51415
Substrate
Meas. Tech.
SAR assay for compounds activating TNAP in the presence of 100 mM DEA performed in a luminescence assay
EC50
4700±n/a nM
Citation
 PubChem, PC SAR assay for compounds activating TNAP in the presence of 100 mM DEA performed in a luminescence assay PubChem Bioassay (2009)[AID] 
Target
Name:
Alkaline phosphatase, tissue-nonspecific isozyme
Synonyms:
ALPL tissue-nonspecific alkaline phosphatase precursor
Type:
PROTEIN
Mol. Mass.:
57306.17
Organism:
Homo sapiens (Human)
Description:
ChEMBL_1448917
Residue:
524
  
Inhibitor
Name:
BDBM51415
Synonyms:
2-(4-methoxyphenoxy)-N-(1H-1,2,4-triazol-5-yl)acetamide MLS-0315836.0001 | cid_703717
Type:
Small organic molecule
Emp. Form.:
C11H12N4O3
Mol. Mass.:
248.238
SMILES:
COc1ccc(OCC(=O)Nc2nnc[nH]2)cc1
: