Target
Alkaline phosphatase, tissue-nonspecific isozyme
Ligand
BDBM51422
Substrate
Meas. Tech.
SAR assay for compounds activating TNAP in the presence of 100 mM DEA performed in a luminescence assay
EC50
3200±n/a nM
Citation
 PubChem, PC SAR assay for compounds activating TNAP in the presence of 100 mM DEA performed in a luminescence assay PubChem Bioassay (2009)[AID] 
Target
Name:
Alkaline phosphatase, tissue-nonspecific isozyme
Synonyms:
ALPL tissue-nonspecific alkaline phosphatase precursor
Type:
PROTEIN
Mol. Mass.:
57306.17
Organism:
Homo sapiens (Human)
Description:
ChEMBL_1448917
Residue:
524
  
Inhibitor
Name:
BDBM51422
Synonyms:
2-(2,6-dimethylphenoxy)-N-(1H-1,2,4-triazol-5-yl)acetamide MLS-0021303.0001 | cid_650512
Type:
Small organic molecule
Emp. Form.:
C12H14N4O2
Mol. Mass.:
246.2652
SMILES:
Cc1cccc(C)c1OCC(=O)Nc1nnc[nH]1
: