Target
Alkaline phosphatase, tissue-nonspecific isozyme
Ligand
BDBM51424
Substrate
Meas. Tech.
SAR assay for compounds activating TNAP in the presence of 100 mM DEA performed in a luminescence assay
EC50
71100±n/a nM
Citation
 PubChem, PC SAR assay for compounds activating TNAP in the presence of 100 mM DEA performed in a luminescence assay PubChem Bioassay (2009)[AID] 
Target
Name:
Alkaline phosphatase, tissue-nonspecific isozyme
Synonyms:
ALPL tissue-nonspecific alkaline phosphatase precursor
Type:
PROTEIN
Mol. Mass.:
57306.17
Organism:
Homo sapiens (Human)
Description:
ChEMBL_1448917
Residue:
524
  
Inhibitor
Name:
BDBM51424
Synonyms:
4-chloranyl-3-nitro-N-(1H-1,2,4-triazol-5-yl)benzamide MLS-0315820.0001 | cid_3108184
Type:
Small organic molecule
Emp. Form.:
C9H6ClN5O3
Mol. Mass.:
267.629
SMILES:
[O-][N+](=O)c1cc(ccc1Cl)C(=O)Nc1nnc[nH]1
: