Target
Alkaline phosphatase, tissue-nonspecific isozyme
Ligand
BDBM51429
Substrate
Meas. Tech.
SAR assay for compounds activating TNAP in the presence of 100 mM DEA performed in a luminescence assay
EC50
9630±n/a nM
Citation
 PubChem, PC SAR assay for compounds activating TNAP in the presence of 100 mM DEA performed in a luminescence assay PubChem Bioassay (2009)[AID] 
Target
Name:
Alkaline phosphatase, tissue-nonspecific isozyme
Synonyms:
ALPL tissue-nonspecific alkaline phosphatase precursor
Type:
PROTEIN
Mol. Mass.:
57306.17
Organism:
Homo sapiens (Human)
Description:
ChEMBL_1448917
Residue:
524
  
Inhibitor
Name:
BDBM51429
Synonyms:
2-hydroxy-N-(1H-1,2,4-triazol-5-yl)benzamide MLS-0299428.0001 | cid_94473
Type:
Small organic molecule
Emp. Form.:
C9H8N4O2
Mol. Mass.:
204.1854
SMILES:
Oc1ccccc1C(=O)Nc1nnc[nH]1
: