Target
Alkaline phosphatase, tissue-nonspecific isozyme
Ligand
BDBM51399
Substrate
Meas. Tech.
SAR assay for compounds activating TNAP in the presence of 100 mM DEA performed in a luminescence assay
EC50
4450±n/a nM
Citation
 PubChem, PC SAR assay for compounds activating TNAP in the presence of 100 mM DEA performed in a luminescence assay PubChem Bioassay (2009)[AID] 
Target
Name:
Alkaline phosphatase, tissue-nonspecific isozyme
Synonyms:
ALPL tissue-nonspecific alkaline phosphatase precursor
Type:
PROTEIN
Mol. Mass.:
57306.17
Organism:
Homo sapiens (Human)
Description:
ChEMBL_1448917
Residue:
524
  
Inhibitor
Name:
BDBM51399
Synonyms:
2-cyclohexyl-N-(1H-1,2,4-triazol-5-yl)acetamide MLS-0072999.0001 | cid_704227
Type:
Small organic molecule
Emp. Form.:
C10H16N4O
Mol. Mass.:
208.2602
SMILES:
O=C(CC1CCCCC1)Nc1nnc[nH]1
: