Target
Mucolipin-3
Ligand
BDBM46752
Substrate
Meas. Tech.
Fluorescence counterscreen assay for TRPN1 agonists: dose response cell-based high-throughput screening assay to identify agonists of the transient receptor potential channel ML3 (TRPML3)
EC50
29900±n/a nM
Citation
 PubChem, PC Fluorescence counterscreen assay for TRPN1 agonists: dose response cell-based high-throughput screening assay to identify agonists of the transient receptor potential channel ML3 (TRPML3) PubChem Bioassay (2009)[AID] 
Target
Name:
Mucolipin-3
Synonyms:
MCLN3_HUMAN MCOLN3 protein
Type:
Enzyme Catalytic Domain
Mol. Mass.:
64244.09
Organism:
Homo sapiens (Human)
Description:
Q8TDD5
Residue:
553
  
Inhibitor
Name:
BDBM46752
Synonyms:
6-(1,3-benzodioxol-5-yl)-4-hydroxy-2-keto-4-(trifluoromethyl)hexahydropyrimidine-5-carboxylic acid ethyl ester MLS000096828 cid_2946745 ethyl 6-(1,3-benzodioxol-5-yl)-4-hydroxy-2-oxo-4-(trifluoromethyl)hexahydro-5-pyrimidinecarboxylate | ethyl 6-(1,3-benzodioxol-5-yl)-4-oxidanyl-2-oxidanylidene-4-(trifluoromethyl)-1,3-diazinane-5-carboxylate
Type:
Small organic molecule
Emp. Form.:
C15H15F3N2O6
Mol. Mass.:
376.2846
SMILES:
CCOC(=O)C1C(NC(=O)NC1(O)C(F)(F)F)c1ccc2OCOc2c1
: