Target
Mucolipin-3
Ligand
BDBM46787
Substrate
Meas. Tech.
Fluorescence counterscreen assay for TRPN1 agonists: dose response cell-based high-throughput screening assay to identify agonists of the transient receptor potential channel ML3 (TRPML3)
EC50
29900±n/a nM
Citation
 PubChem, PC Fluorescence counterscreen assay for TRPN1 agonists: dose response cell-based high-throughput screening assay to identify agonists of the transient receptor potential channel ML3 (TRPML3) PubChem Bioassay (2009)[AID] 
Target
Name:
Mucolipin-3
Synonyms:
MCLN3_HUMAN MCOLN3 protein
Type:
Enzyme Catalytic Domain
Mol. Mass.:
64244.09
Organism:
Homo sapiens (Human)
Description:
Q8TDD5
Residue:
553
  
Inhibitor
Name:
BDBM46787
Synonyms:
(2-Cyclohex-1-enyl-ethyl)-(8-methoxy-5H-pyrimido[5,4-b]indol-4-yl)-amine MLS000592053 N-[2-(cyclohexen-1-yl)ethyl]-8-methoxy-5H-pyrimido[5,4-b]indol-4-amine cid_945564
Type:
Small organic molecule
Emp. Form.:
C19H22N4O
Mol. Mass.:
322.4042
SMILES:
COc1ccc2[nH]c3c(NCCC4=CCCCC4)ncnc3c2c1
: