Target
Ion channel NompC
Ligand
BDBM46849
Substrate
Meas. Tech.
Fluorescence counterscreen assay for TRPML3 agonists: dose response cell-based high-throughput screening assay to identify agonists of the transient receptor potential channel N1 (TRPN1)
EC50
29900±n/a nM
Citation
 PubChem, PC Fluorescence counterscreen assay for TRPML3 agonists: dose response cell-based high-throughput screening assay to identify agonists of the transient receptor potential channel N1 (TRPN1) PubChem Bioassay (2009)[AID] 
Target
Name:
Ion channel NompC
Synonyms:
transient receptor potential cation channel, subfamily N, member 1
Type:
Enzyme Catalytic Domain
Mol. Mass.:
175824.78
Organism:
Danio rerio
Description:
Q7T1G6
Residue:
1614
  
Inhibitor
Name:
BDBM46849
Synonyms:
4-(3,5-dimethyl-1-pyrazolyl)-6-methyl-N-(phenylmethyl)-1,3,5-triazin-2-amine MLS000109208 SMR000105154 cid_877206
Type:
Small organic molecule
Emp. Form.:
C16H18N6
Mol. Mass.:
294.3543
SMILES:
Cc1cc(C)n(n1)-c1nc(C)nc(NCc2ccccc2)n1
: