Target
Ion channel NompC
Ligand
BDBM46857
Substrate
Meas. Tech.
Fluorescence counterscreen assay for TRPML3 agonists: dose response cell-based high-throughput screening assay to identify agonists of the transient receptor potential channel N1 (TRPN1)
EC50
29900±n/a nM
Citation
 PubChem, PC Fluorescence counterscreen assay for TRPML3 agonists: dose response cell-based high-throughput screening assay to identify agonists of the transient receptor potential channel N1 (TRPN1) PubChem Bioassay (2009)[AID] 
Target
Name:
Ion channel NompC
Synonyms:
transient receptor potential cation channel, subfamily N, member 1
Type:
Enzyme Catalytic Domain
Mol. Mass.:
175824.78
Organism:
Danio rerio
Description:
Q7T1G6
Residue:
1614
  
Inhibitor
Name:
BDBM46857
Synonyms:
4,4-dimethyl-3-(4-methylphenyl)sulfonyl-1,3-thiazolidine-2-thione 4,4-dimethyl-3-tosyl-thiazolidine-2-thione SMR000104433 | cid_792335
Type:
Small organic molecule
Emp. Form.:
C12H15NO2S3
Mol. Mass.:
301.448
SMILES:
Cc1ccc(cc1)S(=O)(=O)N1C(=S)SCC1(C)C
: