Target
Ion channel NompC
Ligand
BDBM39637
Substrate
Meas. Tech.
Fluorescence counterscreen assay for TRPML3 agonists: dose response cell-based high-throughput screening assay to identify agonists of the transient receptor potential channel N1 (TRPN1)
EC50
29900±n/a nM
Citation
 PubChem, PC Fluorescence counterscreen assay for TRPML3 agonists: dose response cell-based high-throughput screening assay to identify agonists of the transient receptor potential channel N1 (TRPN1) PubChem Bioassay (2009)[AID] 
Target
Name:
Ion channel NompC
Synonyms:
transient receptor potential cation channel, subfamily N, member 1
Type:
Enzyme Catalytic Domain
Mol. Mass.:
175824.78
Organism:
Danio rerio
Description:
Q7T1G6
Residue:
1614
  
Inhibitor
Name:
BDBM39637
Synonyms:
4-Methyl-1-(naphthalene-2-sulfonyl)-piperidine 4-methyl-1-(2-naphthylsulfonyl)piperidine 4-methyl-1-naphthalen-2-ylsulfonylpiperidine SMR000122855 | cid_767330
Type:
Small organic molecule
Emp. Form.:
C16H19NO2S
Mol. Mass.:
289.393
SMILES:
CC1CCN(CC1)S(=O)(=O)c1ccc2ccccc2c1
: