Target
Ion channel NompC
Ligand
BDBM46863
Substrate
Meas. Tech.
Fluorescence counterscreen assay for TRPML3 agonists: dose response cell-based high-throughput screening assay to identify agonists of the transient receptor potential channel N1 (TRPN1)
EC50
29900±n/a nM
Citation
 PubChem, PC Fluorescence counterscreen assay for TRPML3 agonists: dose response cell-based high-throughput screening assay to identify agonists of the transient receptor potential channel N1 (TRPN1) PubChem Bioassay (2009)[AID] 
Target
Name:
Ion channel NompC
Synonyms:
transient receptor potential cation channel, subfamily N, member 1
Type:
Enzyme Catalytic Domain
Mol. Mass.:
175824.78
Organism:
Danio rerio
Description:
Q7T1G6
Residue:
1614
  
Inhibitor
Name:
BDBM46863
Synonyms:
1-(4-Ethoxy-naphthalene-1-sulfonyl)-azepane 1-[(4-ethoxy-1-naphthalenyl)sulfonyl]azepane MLS000123160 cid_776924
Type:
Small organic molecule
Emp. Form.:
C18H23NO3S
Mol. Mass.:
333.445
SMILES:
CCOc1ccc(c2ccccc12)S(=O)(=O)N1CCCCCC1
: