Target
Ion channel NompC
Ligand
BDBM46867
Substrate
Meas. Tech.
Fluorescence counterscreen assay for TRPML3 agonists: dose response cell-based high-throughput screening assay to identify agonists of the transient receptor potential channel N1 (TRPN1)
EC50
29900±n/a nM
Citation
 PubChem, PC Fluorescence counterscreen assay for TRPML3 agonists: dose response cell-based high-throughput screening assay to identify agonists of the transient receptor potential channel N1 (TRPN1) PubChem Bioassay (2009)[AID] 
Target
Name:
Ion channel NompC
Synonyms:
transient receptor potential cation channel, subfamily N, member 1
Type:
Enzyme Catalytic Domain
Mol. Mass.:
175824.78
Organism:
Danio rerio
Description:
Q7T1G6
Residue:
1614
  
Inhibitor
Name:
BDBM46867
Synonyms:
1-(benzenesulfonyl)-3-methyl-5-[(phenylmethyl)amino]-4-pyrazolecarboxylic acid ethyl ester MLS000549998 cid_986232 ethyl 3-methyl-5-[(phenylmethyl)amino]-1-(phenylsulfonyl)pyrazole-4-carboxylate | ethyl 5-(benzylamino)-3-methyl-1-(phenylsulfonyl)-1H-pyrazole-4-carboxylate
Type:
Small organic molecule
Emp. Form.:
C20H21N3O4S
Mol. Mass.:
399.463
SMILES:
CCOC(=O)c1c(C)nn(c1NCc1ccccc1)S(=O)(=O)c1ccccc1
: