Target
Ion channel NompC
Ligand
BDBM46888
Substrate
Meas. Tech.
Fluorescence counterscreen assay for TRPML3 agonists: dose response cell-based high-throughput screening assay to identify agonists of the transient receptor potential channel N1 (TRPN1)
EC50
29900±n/a nM
Citation
 PubChem, PC Fluorescence counterscreen assay for TRPML3 agonists: dose response cell-based high-throughput screening assay to identify agonists of the transient receptor potential channel N1 (TRPN1) PubChem Bioassay (2009)[AID] 
Target
Name:
Ion channel NompC
Synonyms:
transient receptor potential cation channel, subfamily N, member 1
Type:
Enzyme Catalytic Domain
Mol. Mass.:
175824.78
Organism:
Danio rerio
Description:
Q7T1G6
Residue:
1614
  
Inhibitor
Name:
BDBM46888
Synonyms:
5-chloranyl-N-(2-piperidin-1-ylphenyl)thiophene-2-sulfonamide 5-chloro-N-(2-piperidinophenyl)thiophene-2-sulfonamide MLS000570381 cid_2111037
Type:
Small organic molecule
Emp. Form.:
C15H17ClN2O2S2
Mol. Mass.:
356.891
SMILES:
Clc1ccc(s1)S(=O)(=O)Nc1ccccc1N1CCCCC1
: