Target
Ion channel NompC
Ligand
BDBM46906
Substrate
Meas. Tech.
Fluorescence counterscreen assay for TRPML3 agonists: dose response cell-based high-throughput screening assay to identify agonists of the transient receptor potential channel N1 (TRPN1)
EC50
29900±n/a nM
Citation
 PubChem, PC Fluorescence counterscreen assay for TRPML3 agonists: dose response cell-based high-throughput screening assay to identify agonists of the transient receptor potential channel N1 (TRPN1) PubChem Bioassay (2009)[AID] 
Target
Name:
Ion channel NompC
Synonyms:
transient receptor potential cation channel, subfamily N, member 1
Type:
Enzyme Catalytic Domain
Mol. Mass.:
175824.78
Organism:
Danio rerio
Description:
Q7T1G6
Residue:
1614
  
Inhibitor
Name:
BDBM46906
Synonyms:
3-[(4-chlorophenyl)sulfonyl-methyl-amino]-4-methoxy-N-(4-methylphenyl)benzenesulfonamide 3-[(4-chlorophenyl)sulfonyl-methylamino]-4-methoxy-N-(4-methylphenyl)benzenesulfonamide MLS000582088 cid_2975504
Type:
Small organic molecule
Emp. Form.:
C21H21ClN2O5S2
Mol. Mass.:
480.985
SMILES:
COc1ccc(cc1N(C)S(=O)(=O)c1ccc(Cl)cc1)S(=O)(=O)Nc1ccc(C)cc1
: