Target
Ion channel NompC
Ligand
BDBM46953
Substrate
Meas. Tech.
Fluorescence counterscreen assay for TRPML3 agonists: dose response cell-based high-throughput screening assay to identify agonists of the transient receptor potential channel N1 (TRPN1)
EC50
29900±n/a nM
Citation
 PubChem, PC Fluorescence counterscreen assay for TRPML3 agonists: dose response cell-based high-throughput screening assay to identify agonists of the transient receptor potential channel N1 (TRPN1) PubChem Bioassay (2009)[AID] 
Target
Name:
Ion channel NompC
Synonyms:
transient receptor potential cation channel, subfamily N, member 1
Type:
Enzyme Catalytic Domain
Mol. Mass.:
175824.78
Organism:
Danio rerio
Description:
Q7T1G6
Residue:
1614
  
Inhibitor
Name:
BDBM46953
Synonyms:
1-(2-naphthalenylsulfonyl)azepane 1-naphthalen-2-ylsulfonylazepane SMR000273906 | cid_2791622
Type:
Small organic molecule
Emp. Form.:
C16H19NO2S
Mol. Mass.:
289.393
SMILES:
O=S(=O)(N1CCCCCC1)c1ccc2ccccc2c1
: