Target
Ion channel NompC
Ligand
BDBM46955
Substrate
Meas. Tech.
Fluorescence counterscreen assay for TRPML3 agonists: dose response cell-based high-throughput screening assay to identify agonists of the transient receptor potential channel N1 (TRPN1)
EC50
29900±n/a nM
Citation
 PubChem, PC Fluorescence counterscreen assay for TRPML3 agonists: dose response cell-based high-throughput screening assay to identify agonists of the transient receptor potential channel N1 (TRPN1) PubChem Bioassay (2009)[AID] 
Target
Name:
Ion channel NompC
Synonyms:
transient receptor potential cation channel, subfamily N, member 1
Type:
Enzyme Catalytic Domain
Mol. Mass.:
175824.78
Organism:
Danio rerio
Description:
Q7T1G6
Residue:
1614
  
Inhibitor
Name:
BDBM46955
Synonyms:
4-methyl-1-(4-propan-2-ylphenyl)sulfonyl-piperidine 4-methyl-1-p-cumenylsulfonyl-piperidine SMR000272691 | cid_801435
Type:
Small organic molecule
Emp. Form.:
C15H23NO2S
Mol. Mass.:
281.414
SMILES:
CC(C)c1ccc(cc1)S(=O)(=O)N1CCC(C)CC1
: