Target
Ion channel NompC
Ligand
BDBM46966
Substrate
Meas. Tech.
Fluorescence counterscreen assay for TRPML3 agonists: dose response cell-based high-throughput screening assay to identify agonists of the transient receptor potential channel N1 (TRPN1)
EC50
29900±n/a nM
Citation
 PubChem, PC Fluorescence counterscreen assay for TRPML3 agonists: dose response cell-based high-throughput screening assay to identify agonists of the transient receptor potential channel N1 (TRPN1) PubChem Bioassay (2009)[AID] 
Target
Name:
Ion channel NompC
Synonyms:
transient receptor potential cation channel, subfamily N, member 1
Type:
Enzyme Catalytic Domain
Mol. Mass.:
175824.78
Organism:
Danio rerio
Description:
Q7T1G6
Residue:
1614
  
Inhibitor
Name:
BDBM46966
Synonyms:
2-(2-methylphenoxy)-N-[2-(4-methyl-1-piperazinyl)-5-(1-piperidinylsulfonyl)phenyl]acetamide 2-(2-methylphenoxy)-N-[2-(4-methylpiperazin-1-yl)-5-piperidin-1-ylsulfonylphenyl]acetamide MLS000775569 cid_4840499
Type:
Small organic molecule
Emp. Form.:
C25H34N4O4S
Mol. Mass.:
486.627
SMILES:
CN1CCN(CC1)c1ccc(cc1NC(=O)COc1ccccc1C)S(=O)(=O)N1CCCCC1
: