Target
Ion channel NompC
Ligand
BDBM46973
Substrate
Meas. Tech.
Fluorescence counterscreen assay for TRPML3 agonists: dose response cell-based high-throughput screening assay to identify agonists of the transient receptor potential channel N1 (TRPN1)
EC50
29900±n/a nM
Citation
 PubChem, PC Fluorescence counterscreen assay for TRPML3 agonists: dose response cell-based high-throughput screening assay to identify agonists of the transient receptor potential channel N1 (TRPN1) PubChem Bioassay (2009)[AID] 
Target
Name:
Ion channel NompC
Synonyms:
transient receptor potential cation channel, subfamily N, member 1
Type:
Enzyme Catalytic Domain
Mol. Mass.:
175824.78
Organism:
Danio rerio
Description:
Q7T1G6
Residue:
1614
  
Inhibitor
Name:
BDBM46973
Synonyms:
MLS001002022 N-(5-cyclopropyl-1,3,4-thiadiazol-2-yl)-2-[4-[methyl-(4-methylphenyl)sulfonyl-amino]phenoxy]ethanamide SMR000368213 | cid_2461065
Type:
Small organic molecule
Emp. Form.:
C21H22N4O4S2
Mol. Mass.:
458.554
SMILES:
CN(c1ccc(OCC(=O)Nc2nnc(s2)C2CC2)cc1)S(=O)(=O)c1ccc(C)cc1
: