Target
Ion channel NompC
Ligand
BDBM46977
Substrate
Meas. Tech.
Fluorescence counterscreen assay for TRPML3 agonists: dose response cell-based high-throughput screening assay to identify agonists of the transient receptor potential channel N1 (TRPN1)
EC50
29900±n/a nM
Citation
 PubChem, PC Fluorescence counterscreen assay for TRPML3 agonists: dose response cell-based high-throughput screening assay to identify agonists of the transient receptor potential channel N1 (TRPN1) PubChem Bioassay (2009)[AID] 
Target
Name:
Ion channel NompC
Synonyms:
transient receptor potential cation channel, subfamily N, member 1
Type:
Enzyme Catalytic Domain
Mol. Mass.:
175824.78
Organism:
Danio rerio
Description:
Q7T1G6
Residue:
1614
  
Inhibitor
Name:
BDBM46977
Synonyms:
3-(1-Furan-2-yl-2-nitro-ethyl)-2-oxo-4-phenyl-pyrrolidine-3-carboxylic acid methyl ester 3-[1-(2-furyl)-2-nitro-ethyl]-2-keto-4-phenyl-pyrrolidine-3-carboxylic acid methyl ester SMR000427123 methyl 3-[1-(furan-2-yl)-2-nitro-ethyl]-2-oxidanylidene-4-phenyl-pyrrolidine-3-carboxylate | methyl 3-[1-(furan-2-yl)-2-nitroethyl]-2-oxo-4-phenylpyrrolidine-3-carboxylate
Type:
Small organic molecule
Emp. Form.:
C18H18N2O6
Mol. Mass.:
358.3453
SMILES:
COC(=O)C1(C(C[N+]([O-])=O)c2ccco2)C(CNC1=O)c1ccccc1
: