Target
Ion channel NompC
Ligand
BDBM46978
Substrate
Meas. Tech.
Fluorescence counterscreen assay for TRPML3 agonists: dose response cell-based high-throughput screening assay to identify agonists of the transient receptor potential channel N1 (TRPN1)
EC50
29900±n/a nM
Citation
 PubChem, PC Fluorescence counterscreen assay for TRPML3 agonists: dose response cell-based high-throughput screening assay to identify agonists of the transient receptor potential channel N1 (TRPN1) PubChem Bioassay (2009)[AID] 
Target
Name:
Ion channel NompC
Synonyms:
transient receptor potential cation channel, subfamily N, member 1
Type:
Enzyme Catalytic Domain
Mol. Mass.:
175824.78
Organism:
Danio rerio
Description:
Q7T1G6
Residue:
1614
  
Inhibitor
Name:
BDBM46978
Synonyms:
MLS001029917 [(2-methyl-4-oxidanylidene-5-propan-2-yl-cyclohexa-2,5-dien-1-ylidene)amino] benzenesulfonate benzenesulfonic acid [(2-methyl-4-oxo-5-propan-2-yl-1-cyclohexa-2,5-dienylidene)amino] ester benzenesulfonic acid [(Z)-(5-isopropyl-4-keto-2-methyl-cyclohexa-2,5-dien-1-ylidene)amino] ester | cid_1909670
Type:
Small organic molecule
Emp. Form.:
C16H17NO4S
Mol. Mass.:
319.375
SMILES:
CC(=C)c1cc(NOS(=O)(=O)c2ccccc2)c(C)cc1O
: