Target
Ion channel NompC
Ligand
BDBM46980
Substrate
Meas. Tech.
Fluorescence counterscreen assay for TRPML3 agonists: dose response cell-based high-throughput screening assay to identify agonists of the transient receptor potential channel N1 (TRPN1)
EC50
7420±n/a nM
Citation
 PubChem, PC Fluorescence counterscreen assay for TRPML3 agonists: dose response cell-based high-throughput screening assay to identify agonists of the transient receptor potential channel N1 (TRPN1) PubChem Bioassay (2009)[AID] 
Target
Name:
Ion channel NompC
Synonyms:
transient receptor potential cation channel, subfamily N, member 1
Type:
Enzyme Catalytic Domain
Mol. Mass.:
175824.78
Organism:
Danio rerio
Description:
Q7T1G6
Residue:
1614
  
Inhibitor
Name:
BDBM46980
Synonyms:
3,4-Dimethoxy-N-[N'-(5-methyl-3-phenyl-isoxazole-4-carbonyl)-hydrazinocarbothioyl]-benzamide 3,4-dimethoxy-N-[[(5-methyl-3-phenyl-1,2-oxazole-4-carbonyl)amino]carbamothioyl]benzamide 3,4-dimethoxy-N-[[[(5-methyl-3-phenyl-4-isoxazolyl)-oxomethyl]hydrazo]-sulfanylidenemethyl]benzamide SMR000434126 | cid_1884111
Type:
Small organic molecule
Emp. Form.:
C21H20N4O5S
Mol. Mass.:
440.472
SMILES:
COc1ccc(cc1OC)C(=O)NC(=S)NNC(=O)c1c(C)onc1-c1ccccc1
: