Target
Solute carrier family 12 member 5
Ligand
BDBM43873
Substrate
Meas. Tech.
Identification of Novel Modulators of Cl- dependent Transport Process via HTS: Dose-Dependent Assay 2 with KCC2
EC50
2290±n/a nM
Citation
 PubChem, PC Identification of Novel Modulators of Cl- dependent Transport Process via HTS: Dose-Dependent Assay 2 with KCC2 PubChem Bioassay (2009)[AID] 
Target
Name:
Solute carrier family 12 member 5
Synonyms:
Electroneutral potassium-chloride cotransporter 2 KCC2 Neuronal K-Cl cotransporter SLC12A5 electroneutral potassium-chloride cotransporter KCC2 | hKCC2
Type:
PROTEIN
Mol. Mass.:
126185.18
Organism:
Homo sapiens (Human)
Description:
ChEMBL_828024
Residue:
1139
  
Inhibitor
Name:
BDBM43873
Synonyms:
1-[(Z)-[1-[(4-fluorophenyl)methyl]-2-oxidanylidene-indol-3-ylidene]amino]thiourea SMR000211591 [(Z)-[1-[(4-fluorophenyl)methyl]-2-oxo-3-indolylidene]amino]thiourea cid_6870780
Type:
Small organic molecule
Emp. Form.:
C16H13FN4OS
Mol. Mass.:
328.364
SMILES:
NC(=S)NN=C1C(=O)N(Cc2ccc(F)cc2)c2ccccc12
: