Target
Solute carrier family 12 member 5
Ligand
BDBM44165
Substrate
Meas. Tech.
Identification of Novel Modulators of Cl- dependent Transport Process via HTS: Dose-Dependent Assay 2 with KCC2
EC50
1740±n/a nM
Citation
 PubChem, PC Identification of Novel Modulators of Cl- dependent Transport Process via HTS: Dose-Dependent Assay 2 with KCC2 PubChem Bioassay (2009)[AID] 
Target
Name:
Solute carrier family 12 member 5
Synonyms:
Electroneutral potassium-chloride cotransporter 2 KCC2 Neuronal K-Cl cotransporter SLC12A5 electroneutral potassium-chloride cotransporter KCC2 | hKCC2
Type:
PROTEIN
Mol. Mass.:
126185.18
Organism:
Homo sapiens (Human)
Description:
ChEMBL_828024
Residue:
1139
  
Inhibitor
Name:
BDBM44165
Synonyms:
3-(methoxycarbothioylamino)thiophene-2-carboxylic acid methyl ester MLS000851508 cid_2808356 methyl 3-[(methoxycarbothioyl)amino]thiophene-2-carboxylate
Type:
Small organic molecule
Emp. Form.:
C8H9NO3S2
Mol. Mass.:
231.292
SMILES:
COC(=S)Nc1ccsc1C(=O)OC
: