Target
Regulator of G-protein signaling 4
Ligand
BDBM47695
Substrate
Meas. Tech.
Dose response, multiplexed high-throughput screen for small molecule regulators of RGS family protein interactions, specifically RGS4-Galphao.
EC50
30000±n/a nM
Citation
 PubChem, PC Dose response, multiplexed high-throughput screen for small molecule regulators of RGS family protein interactions, specifically RGS4-Galphao. PubChem Bioassay (2009)[AID] 
Target
Name:
Regulator of G-protein signaling 4
Synonyms:
RGP4 RGS4_HUMAN | Regulator of G-protein signaling 4 (RGS4)
Type:
Enzyme
Mol. Mass.:
23263.51
Organism:
Homo sapiens (Human)
Description:
P49798
Residue:
205
  
Inhibitor
Name:
BDBM47695
Synonyms:
2-(N-[2-(1-benzotriazolyl)-1-oxoethyl]-2-methoxyanilino)-N-(2-methylbutan-2-yl)-2-(1-methyl-2-pyrrolyl)acetamide 2-[(2-Benzotriazol-1-yl-acetyl)-(2-methoxy-phenyl)-amino]-N-(1,1-dimethyl-propyl)-2-(1-methyl-1H-pyrrol-2-yl)-acetamide MLS000074185 SMR000004342 | cid_646963
Type:
Small organic molecule
Emp. Form.:
C27H32N6O3
Mol. Mass.:
488.5814
SMILES:
CCC(C)(C)NC(=O)C(N(C(=O)Cn1nnc2ccccc12)c1ccccc1OC)c1cccn1C
: