Target
Regulator of G-protein signaling 4
Ligand
BDBM42425
Substrate
Meas. Tech.
Dose response, multiplexed high-throughput screen for small molecule regulators of RGS family protein interactions, specifically RGS4-Galphao.
EC50
30000±n/a nM
Citation
 PubChem, PC Dose response, multiplexed high-throughput screen for small molecule regulators of RGS family protein interactions, specifically RGS4-Galphao. PubChem Bioassay (2009)[AID] 
Target
Name:
Regulator of G-protein signaling 4
Synonyms:
RGP4 RGS4_HUMAN | Regulator of G-protein signaling 4 (RGS4)
Type:
Enzyme
Mol. Mass.:
23263.51
Organism:
Homo sapiens (Human)
Description:
P49798
Residue:
205
  
Inhibitor
Name:
BDBM42425
Synonyms:
MLS000519757 N-[1-(cyclohexylcarbamoyl)cyclohexyl]-N-(furan-2-ylmethyl)pyrazine-2-carboxamide SMR000130175 | cid_4098324
Type:
Small organic molecule
Emp. Form.:
C23H30N4O3
Mol. Mass.:
410.5093
SMILES:
O=C(NC1CCCCC1)C1(CCCCC1)N(Cc1ccco1)C(=O)c1cnccn1
: