Target
Regulator of G-protein signaling 4
Ligand
BDBM33090
Substrate
Meas. Tech.
Dose response, multiplexed high-throughput screen for small molecule regulators of RGS family protein interactions, specifically RGS4-Galphao.
EC50
25230±n/a nM
Citation
 PubChem, PC Dose response, multiplexed high-throughput screen for small molecule regulators of RGS family protein interactions, specifically RGS4-Galphao. PubChem Bioassay (2009)[AID] 
Target
Name:
Regulator of G-protein signaling 4
Synonyms:
RGP4 RGS4_HUMAN | Regulator of G-protein signaling 4 (RGS4)
Type:
Enzyme
Mol. Mass.:
23263.51
Organism:
Homo sapiens (Human)
Description:
P49798
Residue:
205
  
Inhibitor
Name:
BDBM33090
Synonyms:
(4E)-4-[[(2-ethylimino-4-methyl-1,3-thiazol-3-yl)amino]methylidene]-2,3-bis(oxidanyl)cyclohexa-2,5-dien-1-one (4E)-4-[[(2-ethylimino-4-methyl-3-thiazolyl)amino]methylidene]-2,3-dihydroxy-1-cyclohexa-2,5-dienone (4Z)-4-[[(2-ethylimino-4-methyl-4-thiazolin-3-yl)amino]methylene]-2,3-dihydroxy-cyclohexa-2,5-dien-1-one SMR000151702 | cid_5825518
Type:
Small organic molecule
Emp. Form.:
C13H15N3O3S
Mol. Mass.:
293.342
SMILES:
CCN=c1scc(C)n1N=Cc1ccc(O)c(O)c1O
: