Target
Regulator of G-protein signaling 4
Ligand
BDBM47738
Substrate
Meas. Tech.
Dose response, multiplexed high-throughput screen for small molecule regulators of RGS family protein interactions, specifically RGS4-Galphao.
EC50
30000±n/a nM
Citation
 PubChem, PC Dose response, multiplexed high-throughput screen for small molecule regulators of RGS family protein interactions, specifically RGS4-Galphao. PubChem Bioassay (2009)[AID] 
Target
Name:
Regulator of G-protein signaling 4
Synonyms:
RGP4 RGS4_HUMAN | Regulator of G-protein signaling 4 (RGS4)
Type:
Enzyme
Mol. Mass.:
23263.51
Organism:
Homo sapiens (Human)
Description:
P49798
Residue:
205
  
Inhibitor
Name:
BDBM47738
Synonyms:
2-(4-keto-1-phenyl-pyrazolo[3,4-d]pyrimidin-5-yl)-N-(4-morpholinosulfonylphenyl)acetamide N-(4-morpholin-4-ylsulfonylphenyl)-2-(4-oxidanylidene-1-phenyl-pyrazolo[3,4-d]pyrimidin-5-yl)ethanamide N-[4-(4-morpholinylsulfonyl)phenyl]-2-(4-oxo-1-phenyl-5-pyrazolo[3,4-d]pyrimidinyl)acetamide SMR000172350 | cid_1088465
Type:
Small organic molecule
Emp. Form.:
C23H22N6O5S
Mol. Mass.:
494.523
SMILES:
O=C(Cn1cnc2n(ncc2c1=O)-c1ccccc1)Nc1ccc(cc1)S(=O)(=O)N1CCOCC1
: