Target
Regulator of G-protein signaling 4
Ligand
BDBM47750
Substrate
Meas. Tech.
Dose response, multiplexed high-throughput screen for small molecule regulators of RGS family protein interactions, specifically RGS4-Galphao.
EC50
30000±n/a nM
Citation
 PubChem, PC Dose response, multiplexed high-throughput screen for small molecule regulators of RGS family protein interactions, specifically RGS4-Galphao. PubChem Bioassay (2009)[AID] 
Target
Name:
Regulator of G-protein signaling 4
Synonyms:
RGP4 RGS4_HUMAN | Regulator of G-protein signaling 4 (RGS4)
Type:
Enzyme
Mol. Mass.:
23263.51
Organism:
Homo sapiens (Human)
Description:
P49798
Residue:
205
  
Inhibitor
Name:
BDBM47750
Synonyms:
4-[(6-nitro-1,3-benzodioxol-5-yl)methyleneamino]-3-(2-pyridyl)-1H-1,2,4-triazole-5-thione 4-[(6-nitro-1,3-benzodioxol-5-yl)methylideneamino]-3-pyridin-2-yl-1H-1,2,4-triazole-5-thione SMR000255795 | cid_2453423
Type:
Small organic molecule
Emp. Form.:
C15H10N6O4S
Mol. Mass.:
370.343
SMILES:
[O-][N+](=O)c1cc2OCOc2cc1[CH+][N-]n1c(n[nH]c1=S)-c1ccccn1
: