Target
Regulator of G-protein signaling 4
Ligand
BDBM47790
Substrate
Meas. Tech.
Dose response, multiplexed high-throughput screen for small molecule regulators of RGS family protein interactions, specifically RGS4-Galphao.
EC50
30000±n/a nM
Citation
 PubChem, PC Dose response, multiplexed high-throughput screen for small molecule regulators of RGS family protein interactions, specifically RGS4-Galphao. PubChem Bioassay (2009)[AID] 
Target
Name:
Regulator of G-protein signaling 4
Synonyms:
RGP4 RGS4_HUMAN | Regulator of G-protein signaling 4 (RGS4)
Type:
Enzyme
Mol. Mass.:
23263.51
Organism:
Homo sapiens (Human)
Description:
P49798
Residue:
205
  
Inhibitor
Name:
BDBM47790
Synonyms:
2-(4,6-dimethyl-3-oxidanylidene-[1,2]thiazolo[5,4-b]pyridin-2-yl)-N-(3-fluorophenyl)ethanamide 2-(4,6-dimethyl-3-oxo-[1,2]thiazolo[5,4-b]pyridin-2-yl)-N-(3-fluorophenyl)acetamide MLS000689392 SMR000311191 | cid_4247468
Type:
Small organic molecule
Emp. Form.:
C16H14FN3O2S
Mol. Mass.:
331.365
SMILES:
Cc1cc(C)c2c(n1)sn(CC(=O)Nc1cccc(F)c1)c2=O
: