Target
Regulator of G-protein signaling 4
Ligand
BDBM47818
Substrate
Meas. Tech.
Dose response, multiplexed high-throughput screen for small molecule regulators of RGS family protein interactions, specifically RGS4-Galphao.
EC50
30000±n/a nM
Citation
 PubChem, PC Dose response, multiplexed high-throughput screen for small molecule regulators of RGS family protein interactions, specifically RGS4-Galphao. PubChem Bioassay (2009)[AID] 
Target
Name:
Regulator of G-protein signaling 4
Synonyms:
RGP4 RGS4_HUMAN | Regulator of G-protein signaling 4 (RGS4)
Type:
Enzyme
Mol. Mass.:
23263.51
Organism:
Homo sapiens (Human)
Description:
P49798
Residue:
205
  
Inhibitor
Name:
BDBM47818
Synonyms:
1-[3-(4-nitrophenyl)-5,6-dihydroimidazo[2,1-b][1,3]thiazol-7-ium-7-yl]ethanone;bromide 7-Acetyl-3-(4-nitro-phenyl)-6,7-dihydro-5H-imidazo[2,1-b]thiazol-4-ylium SMR000425022 | cid_16682047
Type:
Small organic molecule
Emp. Form.:
C13H12N3O3S
Mol. Mass.:
290.317
SMILES:
CC(=O)N1CC[n+]2c1scc2-c1ccc(cc1)[N+]([O-])=O
: