Target
Regulator of G-protein signaling 4
Ligand
BDBM47823
Substrate
Meas. Tech.
Dose response, multiplexed high-throughput screen for small molecule regulators of RGS family protein interactions, specifically RGS4-Galphao.
EC50
5420±n/a nM
Citation
 PubChem, PC Dose response, multiplexed high-throughput screen for small molecule regulators of RGS family protein interactions, specifically RGS4-Galphao. PubChem Bioassay (2009)[AID] 
Target
Name:
Regulator of G-protein signaling 4
Synonyms:
RGP4 RGS4_HUMAN | Regulator of G-protein signaling 4 (RGS4)
Type:
Enzyme
Mol. Mass.:
23263.51
Organism:
Homo sapiens (Human)
Description:
P49798
Residue:
205
  
Inhibitor
Name:
BDBM47823
Synonyms:
MLS000757112 N-[2,5-bis(chloranyl)-3,6-bis(oxidanylidene)-4-(propanoylamino)cyclohexa-1,4-dien-1-yl]propanamide N-[2,5-dichloro-3,6-dioxo-4-(propanoylamino)cyclohexa-1,4-dien-1-yl]propanamide cid_323616
Type:
Small organic molecule
Emp. Form.:
C12H12Cl2N2O4
Mol. Mass.:
319.141
SMILES:
CCC(=O)NC1=C(Cl)C(=O)C(NC(=O)CC)=C(Cl)C1=O
: