Target
Regulator of G-protein signaling 4
Ligand
BDBM47825
Substrate
Meas. Tech.
Dose response, multiplexed high-throughput screen for small molecule regulators of RGS family protein interactions, specifically RGS4-Galphao.
EC50
30000±n/a nM
Citation
 PubChem, PC Dose response, multiplexed high-throughput screen for small molecule regulators of RGS family protein interactions, specifically RGS4-Galphao. PubChem Bioassay (2009)[AID] 
Target
Name:
Regulator of G-protein signaling 4
Synonyms:
RGP4 RGS4_HUMAN | Regulator of G-protein signaling 4 (RGS4)
Type:
Enzyme
Mol. Mass.:
23263.51
Organism:
Homo sapiens (Human)
Description:
P49798
Residue:
205
  
Inhibitor
Name:
BDBM47825
Synonyms:
MLS000780308 N-[(E)-N'-(5-nitro-1,3-benzoxazol-2-yl)amidino]acetamide N-[(E)-N'-(5-nitro-1,3-benzoxazol-2-yl)carbamimidoyl]ethanamide SMR000420491 | cid_16411063
Type:
Small organic molecule
Emp. Form.:
C10H9N5O4
Mol. Mass.:
263.2096
SMILES:
CC(=O)[NH+]=C(N)[N-]c1nc2cc(ccc2o1)[N+]([O-])=O
: