Target
Dual specificity protein phosphatase 3
Ligand
BDBM51769
Substrate
Meas. Tech.
Fluorescent assay for identification of compounds that inhibit VHR1
IC50
6170±n/a nM
Citation
 PubChem, PC Fluorescent assay for identification of compounds that inhibit VHR1 PubChem Bioassay (2009)[AID] 
Target
Name:
Dual specificity protein phosphatase 3
Synonyms:
DUS3_HUMAN Dual specificity protein phosphatase (VHR) Dual specificity protein phosphatase VHR Tyrosine-protein phosphatase non-receptor type 1 | VHR
Type:
Hydrolase
Mol. Mass.:
20480.58
Organism:
Homo sapiens (Human)
Description:
Residue:
185
  
Inhibitor
Name:
BDBM51769
Synonyms:
1,3-bis(3-morpholin-4-ylpropyl)thiourea 1,3-bis[3-(4-morpholinyl)propyl]thiourea N,N'-bis[3-(4-morpholinyl)propyl]thiourea cid_4056941
Type:
Small organic molecule
Emp. Form.:
C15H30N4O2S
Mol. Mass.:
330.489
SMILES:
S=C(NCCCN1CCOCC1)NCCCN1CCOCC1
: