Target
Dual specificity protein phosphatase 3
Ligand
BDBM46203
Substrate
Meas. Tech.
Fluorescent assay for identification of compounds that inhibit VHR1
IC50
4310±n/a nM
Citation
 PubChem, PC Fluorescent assay for identification of compounds that inhibit VHR1 PubChem Bioassay (2009)[AID] 
Target
Name:
Dual specificity protein phosphatase 3
Synonyms:
DUS3_HUMAN Dual specificity protein phosphatase (VHR) Dual specificity protein phosphatase VHR Tyrosine-protein phosphatase non-receptor type 1 | VHR
Type:
Hydrolase
Mol. Mass.:
20480.58
Organism:
Homo sapiens (Human)
Description:
Residue:
185
  
Inhibitor
Name:
BDBM46203
Synonyms:
1-(2,6-dichlorophenyl)-3-(2-phenylethyl)thiourea 1-[2,6-bis(chloranyl)phenyl]-3-(2-phenylethyl)thiourea cid_2826665
Type:
Small organic molecule
Emp. Form.:
C15H14Cl2N2S
Mol. Mass.:
325.256
SMILES:
Clc1cccc(Cl)c1NC(=S)NCCc1ccccc1
: