Target
Dual specificity protein phosphatase 3
Ligand
BDBM51781
Substrate
Meas. Tech.
Fluorescent assay for identification of compounds that inhibit VHR1
IC50
1230±n/a nM
Citation
 PubChem, PC Fluorescent assay for identification of compounds that inhibit VHR1 PubChem Bioassay (2009)[AID] 
Target
Name:
Dual specificity protein phosphatase 3
Synonyms:
DUS3_HUMAN Dual specificity protein phosphatase (VHR) Dual specificity protein phosphatase VHR Tyrosine-protein phosphatase non-receptor type 1 | VHR
Type:
Hydrolase
Mol. Mass.:
20480.58
Organism:
Homo sapiens (Human)
Description:
Residue:
185
  
Inhibitor
Name:
BDBM51781
Synonyms:
(5E)-1-(4-fluorophenyl)-5-(2-furanylmethylidene)-2-sulfanylidene-1,3-diazinane-4,6-dione (5E)-1-(4-fluorophenyl)-5-(furan-2-ylmethylidene)-2-sulfanylidene-1,3-diazinane-4,6-dione MLS001211808 cid_777365
Type:
Small organic molecule
Emp. Form.:
C15H9FN2O3S
Mol. Mass.:
316.307
SMILES:
Fc1ccc(cc1)N1C(=S)NC(=O)C(=Cc2ccco2)C1=O
: