Target
Dual specificity protein phosphatase 3
Ligand
BDBM51791
Substrate
Meas. Tech.
Fluorescent assay for identification of compounds that inhibit VHR1
IC50
6640±n/a nM
Citation
 PubChem, PC Fluorescent assay for identification of compounds that inhibit VHR1 PubChem Bioassay (2009)[AID] 
Target
Name:
Dual specificity protein phosphatase 3
Synonyms:
DUS3_HUMAN Dual specificity protein phosphatase (VHR) Dual specificity protein phosphatase VHR Tyrosine-protein phosphatase non-receptor type 1 | VHR
Type:
Hydrolase
Mol. Mass.:
20480.58
Organism:
Homo sapiens (Human)
Description:
Residue:
185
  
Inhibitor
Name:
BDBM51791
Synonyms:
5-[(3,5-dimethyl-1-pyrazolyl)methyl]-N-[[5-(4-nitrophenyl)-2-furanyl]methylideneamino]-2-furancarboxamide 5-[(3,5-dimethylpyrazol-1-yl)methyl]-N-[[5-(4-nitrophenyl)-2-furyl]methyleneamino]-2-furamide MLS001240080 cid_1000028
Type:
Small organic molecule
Emp. Form.:
C22H19N5O5
Mol. Mass.:
433.4168
SMILES:
Cc1cc(C)n(Cc2ccc(o2)C(=O)N\N=C\c2ccc(o2)-c2ccc(cc2)[N+]([O-])=O)n1
: