Target
Mitogen-activated protein kinase kinase kinase kinase 2
Ligand
BDBM51793
Substrate
Meas. Tech.
Dose Response Confirmation Screen via Multiplex HTS Assay for Inhibitors of MEK Kinase PB1 Domains, specifically MEK5 binding to MEK Kinase 2 Mutant
EC50
30000±n/a nM
Citation
 PubChem, PC Dose Response Confirmation Screen via Multiplex HTS Assay for Inhibitors of MEK Kinase PB1 Domains, specifically MEK5 binding to MEK Kinase 2 Mutant PubChem Bioassay (2009)[AID] 
Target
Name:
Mitogen-activated protein kinase kinase kinase kinase 2
Synonyms:
2.7.11.1 GC kinase Germinal center kinase MAP4K2 MEK kinase kinase 2 RAB8IP | Rab8-interacting protein
Type:
Mol. Mass.:
91551.35
Organism:
Homo sapiens (Human)
Description:
Residue:
820
  
Inhibitor
Name:
BDBM51793
Synonyms:
4-acetyl-3,5-dimethyl-N-(2-thiazolin-2-yl)-1H-pyrrole-2-carboxamide 4-acetyl-N-(4,5-dihydrothiazol-2-yl)-3,5-dimethyl-1H-pyrrole-2-carboxamide N-(4,5-dihydro-1,3-thiazol-2-yl)-4-ethanoyl-3,5-dimethyl-1H-pyrrole-2-carboxamide cid_2122985
Type:
Small organic molecule
Emp. Form.:
C12H15N3O2S
Mol. Mass.:
265.331
SMILES:
CC(=O)c1c(C)[nH]c(C(=O)NC2=NCCS2)c1C
: