Target
Mitogen-activated protein kinase kinase kinase kinase 2
Ligand
BDBM37692
Substrate
Meas. Tech.
Dose Response Confirmation Screen via Multiplex HTS Assay for Inhibitors of MEK Kinase PB1 Domains, specifically MEK5 binding to MEK Kinase 2 Mutant
EC50
30000±n/a nM
Citation
 PubChem, PC Dose Response Confirmation Screen via Multiplex HTS Assay for Inhibitors of MEK Kinase PB1 Domains, specifically MEK5 binding to MEK Kinase 2 Mutant PubChem Bioassay (2009)[AID] 
Target
Name:
Mitogen-activated protein kinase kinase kinase kinase 2
Synonyms:
2.7.11.1 GC kinase Germinal center kinase MAP4K2 MEK kinase kinase 2 RAB8IP | Rab8-interacting protein
Type:
Mol. Mass.:
91551.35
Organism:
Homo sapiens (Human)
Description:
Residue:
820
  
Inhibitor
Name:
BDBM37692
Synonyms:
(2-aminophenyl)-(4-aminophenyl)amine MLS000084680 SMR000015718 | cid_774866
Type:
Small organic molecule
Emp. Form.:
C12H13N3
Mol. Mass.:
199.2517
SMILES:
Nc1ccc(Nc2ccccc2N)cc1
: