Target
Mitogen-activated protein kinase kinase kinase kinase 2
Ligand
BDBM51802
Substrate
Meas. Tech.
Dose Response Confirmation Screen via Multiplex HTS Assay for Inhibitors of MEK Kinase PB1 Domains, specifically MEK5 binding to MEK Kinase 2 Mutant
EC50
30000±n/a nM
Citation
 PubChem, PC Dose Response Confirmation Screen via Multiplex HTS Assay for Inhibitors of MEK Kinase PB1 Domains, specifically MEK5 binding to MEK Kinase 2 Mutant PubChem Bioassay (2009)[AID] 
Target
Name:
Mitogen-activated protein kinase kinase kinase kinase 2
Synonyms:
2.7.11.1 GC kinase Germinal center kinase MAP4K2 MEK kinase kinase 2 RAB8IP | Rab8-interacting protein
Type:
Mol. Mass.:
91551.35
Organism:
Homo sapiens (Human)
Description:
Residue:
820
  
Inhibitor
Name:
BDBM51802
Synonyms:
4-({1-[3-(1H-imidazol-1-yl)propyl]-5-oxo-2-thioxo-4-imidazolidinylidene}methyl)benzonitrile 4-[(Z)-[1-(3-imidazol-1-ylpropyl)-5-oxidanylidene-2-sulfanylidene-imidazolidin-4-ylidene]methyl]benzenecarbonitrile 4-[(Z)-[1-[3-(1-imidazolyl)propyl]-5-oxo-2-sulfanylidene-4-imidazolidinylidene]methyl]benzonitrile SMR000164089 | cid_6106925
Type:
Small organic molecule
Emp. Form.:
C17H15N5OS
Mol. Mass.:
337.399
SMILES:
O=C1N(CCCn2ccnc2)C(=S)N\C1=C/c1ccc(cc1)C#N
: