Target
Mitogen-activated protein kinase kinase kinase kinase 2
Ligand
BDBM39775
Substrate
Meas. Tech.
Dose Response Confirmation Screen via Multiplex HTS Assay for Inhibitors of MEK Kinase PB1 Domains, specifically MEK5 binding to MEK Kinase 2 Mutant
EC50
910±n/a nM
Citation
 PubChem, PC Dose Response Confirmation Screen via Multiplex HTS Assay for Inhibitors of MEK Kinase PB1 Domains, specifically MEK5 binding to MEK Kinase 2 Mutant PubChem Bioassay (2009)[AID] 
Target
Name:
Mitogen-activated protein kinase kinase kinase kinase 2
Synonyms:
2.7.11.1 GC kinase Germinal center kinase MAP4K2 MEK kinase kinase 2 RAB8IP | Rab8-interacting protein
Type:
Mol. Mass.:
91551.35
Organism:
Homo sapiens (Human)
Description:
Residue:
820
  
Inhibitor
Name:
BDBM39775
Synonyms:
(5E)-5-[(E)-3-[4-(dimethylamino)phenyl]prop-2-enylidene]-3-phenyl-2-sulfanylidene-1,3-thiazolidin-4-one (5E)-5-[(E)-3-[4-(dimethylamino)phenyl]prop-2-enylidene]-3-phenyl-2-thioxo-thiazolidin-4-one MLS000557712 cid_5752007
Type:
Small organic molecule
Emp. Form.:
C20H18N2OS2
Mol. Mass.:
366.5
SMILES:
CN(C)c1ccc(\C=C\C=C2\SC(=S)N(C2=O)c2ccccc2)cc1
: