Target
Mitogen-activated protein kinase kinase kinase kinase 2
Ligand
BDBM51805
Substrate
Meas. Tech.
Dose Response Confirmation Screen via Multiplex HTS Assay for Inhibitors of MEK Kinase PB1 Domains, specifically MEK5 binding to MEK Kinase 2 Mutant
EC50
2230±n/a nM
Citation
 PubChem, PC Dose Response Confirmation Screen via Multiplex HTS Assay for Inhibitors of MEK Kinase PB1 Domains, specifically MEK5 binding to MEK Kinase 2 Mutant PubChem Bioassay (2009)[AID] 
Target
Name:
Mitogen-activated protein kinase kinase kinase kinase 2
Synonyms:
2.7.11.1 GC kinase Germinal center kinase MAP4K2 MEK kinase kinase 2 RAB8IP | Rab8-interacting protein
Type:
Mol. Mass.:
91551.35
Organism:
Homo sapiens (Human)
Description:
Residue:
820
  
Inhibitor
Name:
BDBM51805
Synonyms:
3-(3-chloro-4-methoxybenzyl)-6,7-dimethoxy-2-[(4-methylbenzyl)sulfanyl]-4(3H)-quinazolinimine 3-[(3-chloro-4-methoxyphenyl)methyl]-6,7-dimethoxy-2-[(4-methylphenyl)methylsulfanyl]quinazolin-4-imine MLS000546901 [3-(3-chloro-4-methoxy-benzyl)-6,7-dimethoxy-2-[(4-methylbenzyl)thio]quinazolin-4-ylidene]amine | cid_1489267
Type:
Small organic molecule
Emp. Form.:
C26H26ClN3O3S
Mol. Mass.:
496.021
SMILES:
COc1ccc(Cn2c(SCc3ccc(C)cc3)nc3cc(OC)c(OC)cc3c2=N)cc1Cl
: