Target
Mitogen-activated protein kinase kinase kinase kinase 2
Ligand
BDBM51818
Substrate
Meas. Tech.
Dose Response Confirmation Screen via Multiplex HTS Assay for Inhibitors of MEK Kinase PB1 Domains, specifically MEK5 binding to MEK Kinase 2 Mutant
EC50
30000±n/a nM
Citation
 PubChem, PC Dose Response Confirmation Screen via Multiplex HTS Assay for Inhibitors of MEK Kinase PB1 Domains, specifically MEK5 binding to MEK Kinase 2 Mutant PubChem Bioassay (2009)[AID] 
Target
Name:
Mitogen-activated protein kinase kinase kinase kinase 2
Synonyms:
2.7.11.1 GC kinase Germinal center kinase MAP4K2 MEK kinase kinase 2 RAB8IP | Rab8-interacting protein
Type:
Mol. Mass.:
91551.35
Organism:
Homo sapiens (Human)
Description:
Residue:
820
  
Inhibitor
Name:
BDBM51818
Synonyms:
MLS000696684 N-(6-chloro-1,3-benzothiazol-2-yl)-N-[3-(dimethylamino)propyl]-5,6,7,8-tetrahydronaphthalene-2-carboxamide;hydrochloride SMR000237216 | cid_12006029
Type:
Small organic molecule
Emp. Form.:
C23H26ClN3OS
Mol. Mass.:
427.99
SMILES:
CN(C)CCCN(C(=O)c1ccc2CCCCc2c1)c1nc2ccc(Cl)cc2s1
: